FedoraForum.org - Fedora Support Forums and Community
Results 1 to 1 of 1
  1. #1
    Join Date
    Sep 2017
    Location
    Canada
    Posts
    1

    Archer T2uH

    I am having issues installing a TP-LINK Archer T2UH AC600 in Fedora 26. Here is the output of my make command:

    make:
    make -C tools
    make[1]: Entering directory '/home/user/Downloads/mt7610u_wifi_sta_v3002_dpo_20130916/tools'
    gcc -g bin2h.c -o bin2h
    make[1]: Leaving directory '/home/user/Downloads/mt7610u_wifi_sta_v3002_dpo_20130916/tools'
    /home/user/Downloads/mt7610u_wifi_sta_v3002_dpo_20130916/tools/bin2h
    chipset = mt7610u
    cp -f os/linux/Makefile.6 /home/user/Downloads/mt7610u_wifi_sta_v3002_dpo_20130916/os/linux/Makefile
    make -C /lib/modules/4.12.9-300.fc26.x86_64/build SUBDIRS=/home/user/Downloads/mt7610u_wifi_sta_v3002_dpo_20130916/os/linux modules
    make[1]: Entering directory '/usr/src/kernels/4.12.9-300.fc26.x86_64'
    CC [M] /home/user/Downloads/mt7610u_wifi_sta_v3002_dpo_20130916/os/linux/../../os/linux/rt_profile.o
    In file included from /home/user/Downloads/mt7610u_wifi_sta_v3002_dpo_20130916/include/rtmp_os.h:44:0,
    from /home/user/Downloads/mt7610u_wifi_sta_v3002_dpo_20130916/include/rtmp_comm.h:75,
    from /home/user/Downloads/mt7610u_wifi_sta_v3002_dpo_20130916/include/rt_config.h:33,
    from /home/user/Downloads/mt7610u_wifi_sta_v3002_dpo_20130916/os/linux/../../os/linux/rt_profile.c:28:
    /home/user/Downloads/mt7610u_wifi_sta_v3002_dpo_20130916/include/os/rt_linux.h:77:0: warning: "EXT_BUILD_CHANNEL_LIST" redefined
    #define EXT_BUILD_CHANNEL_LIST /* must define with CRDA */

    <command-line>:0:0: note: this is the location of the previous definition
    In file included from /home/user/Downloads/mt7610u_wifi_sta_v3002_dpo_20130916/include/os/rt_linux.h:98:0,
    from /home/user/Downloads/mt7610u_wifi_sta_v3002_dpo_20130916/include/rtmp_os.h:44,
    from /home/user/Downloads/mt7610u_wifi_sta_v3002_dpo_20130916/include/rtmp_comm.h:75,
    from /home/user/Downloads/mt7610u_wifi_sta_v3002_dpo_20130916/include/rt_config.h:33,
    from /home/user/Downloads/mt7610u_wifi_sta_v3002_dpo_20130916/os/linux/../../os/linux/rt_profile.c:28:
    /home/user/Downloads/mt7610u_wifi_sta_v3002_dpo_20130916/include/cfg80211.h:35:49: error: ‘IEEE80211_NUM_BANDS’ undeclared here (not in a function); did you mean ‘IEEE80211_NUM_TIDS’?
    struct ieee80211_supported_band Cfg80211_bands[IEEE80211_NUM_BANDS];
    ^~~~~~~~~~~~~~~~~~~
    IEEE80211_NUM_TIDS
    /home/user/Downloads/mt7610u_wifi_sta_v3002_dpo_20130916/os/linux/../../os/linux/rt_profile.c: In function ‘announce_802_3_packet’:
    /home/user/Downloads/mt7610u_wifi_sta_v3002_dpo_20130916/os/linux/../../os/linux/rt_profile.c:341:16: warning: unused variable ‘pAd’ [-Wunused-variable]
    RTMP_ADAPTER *pAd = (RTMP_ADAPTER *)pAdSrc;
    ^~~
    In file included from /home/user/Downloads/mt7610u_wifi_sta_v3002_dpo_20130916/include/rtmp_os.h:44:0,
    from /home/user/Downloads/mt7610u_wifi_sta_v3002_dpo_20130916/include/rtmp_comm.h:75,
    from /home/user/Downloads/mt7610u_wifi_sta_v3002_dpo_20130916/include/rt_config.h:33,
    from /home/user/Downloads/mt7610u_wifi_sta_v3002_dpo_20130916/os/linux/../../os/linux/rt_profile.c:28:
    /home/user/Downloads/mt7610u_wifi_sta_v3002_dpo_20130916/os/linux/../../os/linux/rt_profile.c: In function ‘STA_MonPktSend’:
    /home/user/Downloads/mt7610u_wifi_sta_v3002_dpo_20130916/os/linux/../../os/linux/rt_profile.c:450:35: warning: format ‘%d’ expects argument of type ‘int’, but argument 3 has type ‘long unsigned int’ [-Wformat=]
    DBGPRINT(RT_DEBUG_ERROR, ("%s : Size is too large! (%d)\n", __FUNCTION__, pRxBlk->DataSize + sizeof(wlan_ng_prism2_header)));
    ^ ~~~~~~~~~~~~~~~~~~~~~~~~~~~~~~~~~~~~~~~~~~~~~~~~
    /home/user/Downloads/mt7610u_wifi_sta_v3002_dpo_20130916/include/os/rt_linux.h:669:16: note: in definition of macro ‘DBGPRINT_RAW’
    printk Fmt; \
    ^~~
    /home/user/Downloads/mt7610u_wifi_sta_v3002_dpo_20130916/os/linux/../../os/linux/rt_profile.c:450:9: note: in expansion of macro ‘DBGPRINT’
    DBGPRINT(RT_DEBUG_ERROR, ("%s : Size is too large! (%d)\n", __FUNCTION__, pRxBlk->DataSize + sizeof(wlan_ng_prism2_header)));
    ^~~~~~~~
    make[2]: *** [scripts/Makefile.build:303: /home/user/Downloads/mt7610u_wifi_sta_v3002_dpo_20130916/os/linux/../../os/linux/rt_profile.o] Error 1
    make[1]: *** [Makefile:1519: _module_/home/user/Downloads/mt7610u_wifi_sta_v3002_dpo_20130916/os/linux] Error 2
    make[1]: Leaving directory '/usr/src/kernels/4.12.9-300.fc26.x86_64'
    make: *** [Makefile:404: LINUX] Error 2

    lsusb:
    Bus 002 Device 002: ID 8087:0024 Intel Corp. Integrated Rate Matching Hub
    Bus 002 Device 001: ID 1d6b:0002 Linux Foundation 2.0 root hub
    Bus 001 Device 003: ID 8087:07da Intel Corp.
    Bus 001 Device 002: ID 8087:0024 Intel Corp. Integrated Rate Matching Hub
    Bus 001 Device 001: ID 1d6b:0002 Linux Foundation 2.0 root hub
    Bus 004 Device 001: ID 1d6b:0003 Linux Foundation 3.0 root hub
    Bus 003 Device 007: ID 148f:761a Ralink Technology, Corp.
    Bus 003 Device 002: ID 174f:1474 Syntek
    Bus 003 Device 001: ID 1d6b:0002 Linux Foundation 2.0 root hub

    uname -a
    Linux 4.12.9-300.fc26.x86_64 #1 SMP Fri Aug 25 13:09:43 UTC 2017 x86_64 x86_64 x86_64 GNU/Linux

    Any help would be appreiciated.
    Last edited by tneufeld; 6th September 2017 at 08:15 PM.

Similar Threads

  1. Driver Wireless adapter, TP-Link Archer T1U
    By mumbler in forum Hardware & Laptops
    Replies: 2
    Last Post: 30th August 2016, 01:42 AM
  2. Help: Install TP-Link Archer T4U on Fedora 24
    By jpquinn in forum Hardware & Laptops
    Replies: 3
    Last Post: 3rd August 2016, 07:15 PM
  3. Feedback from a longtime Archer
    By Misfit138 in forum Suggestions & Feedback
    Replies: 5
    Last Post: 28th March 2012, 01:59 PM

Tags for this Thread

Posting Permissions

  • You may not post new threads
  • You may not post replies
  • You may not post attachments
  • You may not edit your posts
  •